1
Executing Gradle task: build 
Build info: MCreator 2026.2.30420, neoforge-1.21.1, 64-bit, 15961 MB, Windows 11, JVM 25.0.2, JAVA_HOME: C:\Users\eljas\Desktop\MCreator.2026.2.Windows.64bit (1)\MCreator20262\jdk, started on: 2026-10-20-17:59:40 
 
Reusing configuration cache. 
> Task :processTestResources NO-SOURCE 
> Task :jarJar NO-SOURCE 
> Task :createMinecraftArtifacts UP-TO-DATE 
> Task :processResources UP-TO-DATE 
> Task :compileJava FAILED 
C:\Users\eljas\MCreatorWorkspaces\dungeonica\src\main\java\net\mcreator\dungeonica\block\LiqorootBlock.java:59: error: cannot find symbol 
            return DungeonicaModBlocks.CARVED_LIQOROOT.get().withPropertiesOf(blockstate); 
                                      ^ 
  symbol:   variable CARVED_LIQOROOT 
  location: class DungeonicaModBlocks 
1 error 
FAILURE: Build failed with an exception. 
* What went wrong: 
Execution failed for task ':compileJava' (registered by plugin class 'org.gradle.api.plugins.JavaBasePlugin'). 
> Compilation failed; see the compiler output below. 
C:\Users\eljas\MCreatorWorkspaces\dungeonica\src\main\java\net\mcreator\dungeonica\block\LiqorootBlock.java:59: error: cannot find symbol 
              return DungeonicaModBlocks.CARVED_LIQOROOT.get().withPropertiesOf(blockstate); 
                                        ^ 
    symbol:   variable CARVED_LIQOROOT 
    location: class DungeonicaModBlocks 
  1 error 
* Try: 
> Check your code and dependencies to fix the compilation error(s) 
> Run with --scan to get full insights from a Build Scan (powered by Develocity). 
BUILD FAILED in 646ms 
3 actionable tasks: 1 executed, 2 up-to-date 
Configuration cache entry reused. 
 
BUILD FAILED 
Task completed in less than a second

For immediate assistance, please email our customer support: [email protected]

Download RAW File